BDBM50020932 CHEMBL3287295
SMILES OC(=O)c1nc(ccc1CCCc1ccccc1)N1CCc2cccc(C(=O)Nc3nc4ccccc4s3)c2C1
InChI Key InChIKey=FGFSSZNVGXTQNC-UHFFFAOYSA-N
Data  1 IC50
  Tab Delimited (TSV)   2D SDfile   Computed 3D by Vconf -m prep SDfile
Find this compound or compounds like it in BindingDB:
Activity Spreadsheet -- Enzyme Inhibition Constant Data from BindingDB
Found 1 hit for monomerid = 50020932
TargetBcl-2-like protein 1(Homo sapiens (Human))
Genentech
Curated by ChEMBL
LigandPNGBDBM50020932(CHEMBL3287295)
Affinity DataIC50:  32nM. Assay description: Displacement of 26-mer BIMBH3 peptide from GST-tagged Bcl-Xl (unknown origin) by AlphaScreen assay
In DepthDetails ArticlePubMed