BDBM50020954 CHEMBL3287318
SMILES CS(=O)(=O)Cc1cccc(Nc2nccc(Oc3ccc(NC(=O)C4(CC4)C(=O)Nc4cccc(c4)C(F)(F)F)cc3F)n2)c1
InChI Key InChIKey=DOHXUBMMYMAIQP-UHFFFAOYSA-N
Data  2 IC50
  Tab Delimited (TSV)   2D SDfile   Computed 3D by Vconf -m prep SDfile
Find this compound or compounds like it in BindingDB:
Activity Spreadsheet -- Enzyme Inhibition Constant Data from BindingDB
Found 2 hits for monomerid = 50020954
TargetHepatocyte growth factor receptor(Homo sapiens (Human))
Shanghai Institute Of Materia Medica
Curated by ChEMBL
LigandPNGBDBM50020954(CHEMBL3287318)
Affinity DataIC50:  234nM. Assay description: Inhibition of c-Met (unknown origin) using poly (Glu,Tyr)4:1 as substrate after 60 mins by ELISA
In DepthDetails ArticlePubMed
TargetVascular endothelial growth factor receptor 2(Homo sapiens (Human))
Shanghai Institute Of Materia Medica
Curated by ChEMBL
LigandPNGBDBM50020954(CHEMBL3287318)
Affinity DataIC50:  48nM. Assay description: Inhibition of VEGFR2 (unknown origin) using poly (Glu,Tyr)4:1 as substrate after 60 mins by ELISA
In DepthDetails ArticlePubMed