BDBM50020974 8-(2-Amino-4-chloro-phenyl)-1,3-dimethyl-3,7-dihydro-purine-2,6-dione::CHEMBL268964
SMILES Cn1c2nc([nH]c2c(=O)n(C)c1=O)-c1ccc(Cl)cc1N
InChI Key InChIKey=AHWULPFNBGPTJA-UHFFFAOYSA-N
Data  2 IC50
  Tab Delimited (TSV)   2D SDfile   Computed 3D by Vconf -m prep SDfile
Find this compound or compounds like it in BindingDB:
Activity Spreadsheet -- Enzyme Inhibition Constant Data from BindingDB
Found 2 hits for monomerid = 50020974
TargetAdenosine receptor A1(BOVINE)
TBA
Curated by ChEMBL
LigandPNGBDBM50020974(8-(2-Amino-4-chloro-phenyl)-1,3-dimethyl-3,7-dihyd...)
Affinity DataIC50:  0.350nM. Assay description: Binding affinity against bovine brain adenosine A1 receptor by using N6-[3H]- cyclohexyladenosineChecked by Author
In DepthDetails ArticlePubMed
TargetAdenosine receptor A1(Rattus norvegicus (rat))
TBA
Curated by ChEMBL
LigandPNGBDBM50020974(8-(2-Amino-4-chloro-phenyl)-1,3-dimethyl-3,7-dihyd...)
Affinity DataIC50:  0.400nM. Assay description: Binding affinity against adenosine A1 receptor in rat brain membrane preparations using N6-[3H]-cyclohexyladenosine as a radioligand
In DepthDetails ArticlePubMed