BDBM50020987 4-(1,3-Diethyl-2,6-dioxo-2,3,6,7-tetrahydro-1H-purin-8-yl)-N-(2-dimethylamino-ethyl)-benzenesulfonamide::CHEMBL276201
SMILES CCn1c2nc([nH]c2c(=O)n(CC)c1=O)-c1ccc(cc1)S(=O)(=O)NCCN(C)C
InChI Key InChIKey=KXXRKZIKDIWNSN-UHFFFAOYSA-N
Data  2 IC50
  Tab Delimited (TSV)   2D SDfile   Computed 3D by Vconf -m prep SDfile
Find this compound or compounds like it in BindingDB:
Activity Spreadsheet -- Enzyme Inhibition Constant Data from BindingDB
Found 2 hits for monomerid = 50020987
TargetAdenosine receptor A1(BOVINE)
TBA
Curated by ChEMBL
LigandPNGBDBM50020987(4-(1,3-Diethyl-2,6-dioxo-2,3,6,7-tetrahydro-1H-pur...)
Affinity DataIC50:  3.30nM. Assay description: Binding affinity against bovine brain adenosine A1 receptor by using N6-[3H]- cyclohexyladenosineChecked by Author
In DepthDetails ArticlePubMed
TargetAdenosine receptor A1(Rattus norvegicus (rat))
TBA
Curated by ChEMBL
LigandPNGBDBM50020987(4-(1,3-Diethyl-2,6-dioxo-2,3,6,7-tetrahydro-1H-pur...)
Affinity DataIC50:  116nM. Assay description: Binding affinity against rat brain adenosine A1 receptor by using N6-[3H]- cyclohexyladenosine as radioligandChecked by Author
In DepthDetails ArticlePubMed