BDBM50021505 CHEMBL3290204
SMILES NS(=O)(=O)c1ccc(cc1)-n1nc(nc1-c1ccccc1)C(=O)NC1CCCCC1
InChI Key InChIKey=WLJBYZSHUFEDCX-UHFFFAOYSA-N
Data  2 IC50
  Tab Delimited (TSV)   2D SDfile   Computed 3D by Vconf -m prep SDfile
Find this compound or compounds like it in BindingDB:
Activity Spreadsheet -- Enzyme Inhibition Constant Data from BindingDB
Found 2 hits for monomerid = 50021505
TargetProstaglandin G/H synthase 2(Homo sapiens (Human))
Minia University
Curated by ChEMBL
LigandPNGBDBM50021505(CHEMBL3290204)
Affinity DataIC50:  660nM. Assay description: Inhibition of human recombinant COX2 using ADHP as substrate after 20 mins by fluorescence assay
In DepthDetails ArticlePubMed
TargetProstaglandin G/H synthase 1(Ovis aries (Sheep))
Minia University
Curated by ChEMBL
LigandPNGBDBM50021505(CHEMBL3290204)
Affinity DataIC50: >1.00E+6nM. Assay description: Inhibition of ovine COX1 using ADHP as substrate after 20 mins by fluorescence assay
In DepthDetails ArticlePubMed