BDBM50021838 CHEMBL3298500
SMILES Fc1ccc(Oc2ncnc3[nH]ccc23)cc1F
InChI Key InChIKey=MHVONIOEJOVODB-UHFFFAOYSA-N
Data  1 IC50
  Tab Delimited (TSV)   2D SDfile   Computed 3D by Vconf -m prep SDfile
Find this compound or compounds like it in BindingDB:
Activity Spreadsheet -- Enzyme Inhibition Constant Data from BindingDB
Found 1 hit for monomerid = 50021838
TargetTransient receptor potential cation channel subfamily A member 1(Homo sapiens (Human))
Astrazeneca
Curated by ChEMBL
LigandPNGBDBM50021838(CHEMBL3298500)
Affinity DataIC50:  3.00E+3nM. Assay description: Antagonist activity at human TRPA1 expressed in HEK293-TREx cells assessed as intracellular level after 48 of 72 hrs by Fluo-4 NW staining-based fluo...
In DepthDetails ArticlePubMed