BDBM50022111 CHEMBL3298227
SMILES COc1cccc2nc(Cl)nc(NCC(C)(C)c3ccccc3)c12
InChI Key InChIKey=JLEQOKDDRKNDTM-UHFFFAOYSA-N
Data  1 IC50
  Tab Delimited (TSV)   2D SDfile   Computed 3D by Vconf -m prep SDfile
Find this compound or compounds like it in BindingDB:
Activity Spreadsheet -- Enzyme Inhibition Constant Data from BindingDB
Found 1 hit for monomerid = 50022111
TargetPotassium voltage-gated channel subfamily A member 5(Homo sapiens (Human))
Bristol-Myers Squibb Research And Development
Curated by ChEMBL
LigandPNGBDBM50022111(CHEMBL3298227)
Affinity DataIC50:  73nM. Assay description: Inhibition of human Kv1.5 expressed in mouse L929 cells assessed as inhibition of current
In DepthDetails ArticlePubMed