BDBM50022121 3-Imidazol-1-ylmethyl-2-isopropyl-1H-indole::3-Imidazol-1-ylmethyl-2-isopropyl-1H-indole(UK-34787)::CHEMBL284356
SMILES CC(C)c1[nH]c2ccccc2c1Cn1ccnc1
InChI Key InChIKey=NZXGMVRYQLENHC-UHFFFAOYSA-N
Data  8 IC50
  Tab Delimited (TSV)   2D SDfile   Computed 3D by Vconf -m prep SDfile
Find this compound or compounds like it in BindingDB:
Activity Spreadsheet -- Enzyme Inhibition Constant Data from BindingDB
Found 8 hits for monomerid = 50022121
TargetThromboxane-A synthase(Homo sapiens (Human))
TBA
Curated by ChEMBL
LigandPNGBDBM50022121(3-Imidazol-1-ylmethyl-2-isopropyl-1H-indole | 3-Im...)
Affinity DataIC50:  15nM. Assay description: Inhibition of TXA2 synthetase from human platelets
In DepthDetails ArticlePubMed
TargetCytochrome P450 11B1, mitochondrial(Rattus norvegicus)
TBA
Curated by ChEMBL
LigandPNGBDBM50022121(3-Imidazol-1-ylmethyl-2-isopropyl-1H-indole | 3-Im...)
Affinity DataIC50:  2.00E+3nM. Assay description: Inhibition of 11 beta-hydroxylase from rat adrenal gland
In DepthDetails ArticlePubMed
TargetProstacyclin synthase(Homo sapiens (Human))
TBA
Curated by ChEMBL
LigandPNGBDBM50022121(3-Imidazol-1-ylmethyl-2-isopropyl-1H-indole | 3-Im...)
Affinity DataIC50: >1.00E+5nM. Assay description: Inhibition of PGI-2 synthetase from porcine aorta
In DepthDetails ArticlePubMed
TargetProstaglandin G/H synthase 1/2(Ovis aries (Sheep))
TBA
Curated by ChEMBL
LigandPNGBDBM50022121(3-Imidazol-1-ylmethyl-2-isopropyl-1H-indole | 3-Im...)
Affinity DataIC50: >1.00E+6nM. Assay description: Inhibition of ram seminal vesicle Cyclooxygenase
In DepthDetails ArticlePubMed
TargetThromboxane-A synthase(Homo sapiens (Human))
TBA
Curated by ChEMBL
LigandPNGBDBM50022121(3-Imidazol-1-ylmethyl-2-isopropyl-1H-indole | 3-Im...)
Affinity DataIC50:  15nM. Assay description: Inhibitory activity against thromboxane A2 synthetase
In DepthDetails ArticlePubMed
TargetCytochrome P450 11B1, mitochondrial(Rattus norvegicus)
TBA
Curated by ChEMBL
LigandPNGBDBM50022121(3-Imidazol-1-ylmethyl-2-isopropyl-1H-indole | 3-Im...)
Affinity DataIC50:  2.00E+3nM. Assay description: Inhibition of rat adrenal 11-beta-hydroxylase
In DepthDetails ArticlePubMed
TargetProstaglandin G/H synthase 1/2(Ovis aries (Sheep))
TBA
Curated by ChEMBL
LigandPNGBDBM50022121(3-Imidazol-1-ylmethyl-2-isopropyl-1H-indole | 3-Im...)
Affinity DataIC50: >1.00E+5nM. Assay description: Inhibition of Prostaglandin G/H synthase from ram seminal vesicle microsomes
In DepthDetails ArticlePubMed
TargetProstacyclin synthase(Homo sapiens (Human))
TBA
Curated by ChEMBL
LigandPNGBDBM50022121(3-Imidazol-1-ylmethyl-2-isopropyl-1H-indole | 3-Im...)
Affinity DataIC50: >1.00E+6nM. Assay description: Inhibition of porcine aorta prostacyclin PGI-2 synthase by bioassay method
In DepthDetails ArticlePubMed