BDBM50022125 3-(5-Dimethylamino-3-imidazol-1-ylmethyl-indol-1-yl)-propionic acid::CHEMBL117652
SMILES CN(C)c1ccc2n(CCC(O)=O)cc(Cn3ccnc3)c2c1
InChI Key InChIKey=JRDLUHISHSIQHY-UHFFFAOYSA-N
Data  2 IC50
  Tab Delimited (TSV)   2D SDfile   Computed 3D by Vconf -m prep SDfile
Find this compound or compounds like it in BindingDB:
Activity Spreadsheet -- Enzyme Inhibition Constant Data from BindingDB
Found 2 hits for monomerid = 50022125
TargetProstacyclin synthase(Homo sapiens (Human))
TBA
Curated by ChEMBL
LigandPNGBDBM50022125(3-(5-Dimethylamino-3-imidazol-1-ylmethyl-indol-1-y...)
Affinity DataIC50: >1.00E+5nM. Assay description: Inhibition of PGI-2 synthetase from porcine aorta
In DepthDetails ArticlePubMed
TargetThromboxane-A synthase(Homo sapiens (Human))
TBA
Curated by ChEMBL
LigandPNGBDBM50022125(3-(5-Dimethylamino-3-imidazol-1-ylmethyl-indol-1-y...)
Affinity DataIC50:  82nM. Assay description: Inhibition of TXA2 synthetase from human platelets
In DepthDetails ArticlePubMed