BDBM50022161 6-p-Tolylamino-1H-pyrimidine-2,4-dione::CHEMBL57397
SMILES Cc1ccc(Nc2cc(=O)[nH]c(=O)[nH]2)cc1
InChI Key InChIKey=QKHUPPJBNXWLJB-UHFFFAOYSA-N
Data  5 KI
  Tab Delimited (TSV)   2D SDfile   Computed 3D by Vconf -m prep SDfile
Find this compound or compounds like it in BindingDB:
Activity Spreadsheet -- Enzyme Inhibition Constant Data from BindingDB
Found 5 hits for monomerid = 50022161
TargetDNA topoisomerase 3(Bacillus subtilis)
TBA
Curated by ChEMBL
LigandPNGBDBM50022161(6-p-Tolylamino-1H-pyrimidine-2,4-dione | CHEMBL573...)
Affinity DataKi:  1.70E+4nM. Assay description: Concentration producing 50% inhibition of Bacillus subtilis DNA topoisomerase III in the presence of dATP using DNA Polymerase assay
In DepthDetails ArticlePubMed
TargetDNA topoisomerase 3(Bacillus subtilis)
TBA
Curated by ChEMBL
LigandPNGBDBM50022161(6-p-Tolylamino-1H-pyrimidine-2,4-dione | CHEMBL573...)
Affinity DataKi:  1.75E+4nM. Assay description: Inhibition constant against Bacillus subtilis DNA topoisomerase III (wild type).
In DepthDetails ArticlePubMed
TargetDNA topoisomerase 3(Bacillus subtilis)
TBA
Curated by ChEMBL
LigandPNGBDBM50022161(6-p-Tolylamino-1H-pyrimidine-2,4-dione | CHEMBL573...)
Affinity DataKi:  1.75E+4nM. Assay description: Inhibition against Bacillus subtilis DNA topoisomerase III (wild type)
In DepthDetails ArticlePubMed
TargetDNA polymerase III PolC-type(Bacillus subtilis)
TBA
Curated by ChEMBL
LigandPNGBDBM50022161(6-p-Tolylamino-1H-pyrimidine-2,4-dione | CHEMBL573...)
Affinity DataKi:  6.90E+4nM. Assay description: In vitro inhibition of Bacillus subtilis DNA Polymerase III/azp-12(mutant).
In DepthDetails ArticlePubMed
TargetDNA topoisomerase 3(Bacillus subtilis)
TBA
Curated by ChEMBL
LigandPNGBDBM50022161(6-p-Tolylamino-1H-pyrimidine-2,4-dione | CHEMBL573...)
Affinity DataKi:  6.90E+4nM. Assay description: Inhibition constant against Bacillus subtilis azp-12 DNA topoisomerase III (mutant enzyme).
In DepthDetails ArticlePubMed