BDBM50022401 8-phenylspiro[3,4-dihydro-2H-chromene-4,4'-(tetrahydro-1'H-imidazole)]-2',5'-dione(1/8H2O)::CHEMBL420024
SMILES O=C1NC(=O)C2(CCOc3c(cccc23)-c2ccccc2)N1
InChI Key InChIKey=YOKWLJMQDFBYCL-UHFFFAOYSA-N
Data  1 IC50
  Tab Delimited (TSV)   2D SDfile   Computed 3D by Vconf -m prep SDfile
Find this compound or compounds like it in BindingDB:
Activity Spreadsheet -- Enzyme Inhibition Constant Data from BindingDB
Found 1 hit for monomerid = 50022401
TargetAldo-keto reductase family 1 member B1 [K65Q](Bos taurus (Cattle))
Pfizer
Curated by ChEMBL
LigandPNGBDBM50022401(8-phenylspiro[3,4-dihydro-2H-chromene-4,4'-(tetrah...)
Affinity DataIC50:  1.00E+3nM. Assay description: In vitro inhibitory activity towards partially purified calf lens aldose reductase; value ranges from 10E-6 - 10E-7
In DepthDetails ArticlePubMed