BDBM50022419 6-fluoro-1'-methyl-(4'S)-spiro[3,4-dihydro-2H-chromene-4,4'-(1'H,2'H-imidazole)]-2',5'-dione::CHEMBL79978
SMILES CN1C(=O)N[C@]2(CCOc3ccc(F)cc23)C1=O
InChI Key InChIKey=BMQSVFPKUMYFGH-LBPRGKRZSA-N
Data  1 IC50
  Tab Delimited (TSV)   2D SDfile   Computed 3D by Vconf -m prep SDfile
Find this compound or compounds like it in BindingDB:
Activity Spreadsheet -- Enzyme Inhibition Constant Data from BindingDB
Found 1 hit for monomerid = 50022419
TargetAldo-keto reductase family 1 member B1(Homo sapiens (Human))
Pfizer
Curated by ChEMBL
LigandPNGBDBM50022419(6-fluoro-1'-methyl-(4'S)-spiro[3,4-dihydro-2H-chro...)
Affinity DataIC50: >1.00E+5nM. Assay description: In vitro inhibitory activity towards partially purified human placenta aldose reductase
In DepthDetails ArticlePubMed