BDBM50022420 1',3'-dihydro-2H,5H-spiro[imidazolidine-4,2'-indene]-2,5-dione::CHEMBL79831
SMILES O=C1NC(=O)C2(Cc3ccccc3C2)N1
InChI Key InChIKey=AKYSWRIZYDOSDE-UHFFFAOYSA-N
Data  1 IC50
  Tab Delimited (TSV)   2D SDfile   Computed 3D by Vconf -m prep SDfile
Find this compound or compounds like it in BindingDB:
Activity Spreadsheet -- Enzyme Inhibition Constant Data from BindingDB
Found 1 hit for monomerid = 50022420
TargetAldo-keto reductase family 1 member B1 [K65Q](Bos taurus (Cattle))
Pfizer
Curated by ChEMBL
LigandPNGBDBM50022420(1',3'-dihydro-2H,5H-spiro[imidazolidine-4,2'-inden...)
Affinity DataIC50: >1.00E+5nM. Assay description: In vitro inhibition of partially purified calf lens aldose reductase
In DepthDetails ArticlePubMed