BDBM50022920 Ac-DNal-DCpa-DPal-c[Glu-Arg-DPal-Leu-Arg-Pro-Dpr]-NH2::CHEMBL436334
SMILES CC(C)C[C@@H]1NC(=O)[C@@H](NC(=O)[C@H](CCCNC(N)=N)NC(=O)[C@H](CCC(=O)NC[C@H](NC(=O)[C@@H]2CCCN2C(=O)[C@H](CCCNC(N)=N)NC1=O)C(N)=O)NC(=O)[C@@H](NC(=O)[C@H](Cc1ccc(Cl)cc1)NC(=O)[C@H](Cc1ccc2ccccc2c1)NC(C)=O)c1cccnc1)c1cccnc1
InChI Key InChIKey=KWIBDRKRSZCVLD-MPVHLSGASA-N
Data  1 Kd
  Tab Delimited (TSV)   2D SDfile   Computed 3D by Vconf -m prep SDfile
Find this compound or compounds like it in BindingDB:
Activity Spreadsheet -- Enzyme Inhibition Constant Data from BindingDB
Found 1 hit for monomerid = 50022920
TargetGonadotropin-releasing hormone receptor(Rattus norvegicus)
Salk Institute
Curated by ChEMBL
LigandPNGBDBM50022920(Ac-DNal-DCpa-DPal-c[Glu-Arg-DPal-Leu-Arg-Pro-Dpr]-...)
Affinity DataKd:  1nM. Assay description: Inhibitory binding constant for Gonadotropin-releasing hormone receptor
In DepthDetails ArticlePubMed