BDBM50023156 CHEMBL3298954
SMILES CC(C)COc1cccc(c1)-c1ccc(s1)C(=O)c1cccc(O)c1
InChI Key InChIKey=WRPCMMUXHGQTKF-UHFFFAOYSA-N
Data  2 IC50
  Tab Delimited (TSV)   2D SDfile   Computed 3D by Vconf -m prep SDfile
Find this compound or compounds like it in BindingDB:
Activity Spreadsheet -- Enzyme Inhibition Constant Data from BindingDB
Found 2 hits for monomerid = 50023156
Target17-beta-hydroxysteroid dehydrogenase type 2(Homo sapiens (Human))
Saarland University
Curated by ChEMBL
LigandPNGBDBM50023156(CHEMBL3298954)
Affinity DataIC50:  836nM. Assay description: Inhibition of human placental 17beta-HSD2 microsomal fraction using [2, 4, 6, 7-3H]-estradiol as substrate after 20 mins by HPLC analysis
In DepthDetails ArticlePubMed
Target17-beta-hydroxysteroid dehydrogenase type 1(Homo sapiens (Human))
Saarland University
Curated by ChEMBL
LigandPNGBDBM50023156(CHEMBL3298954)
Affinity DataIC50:  152nM. Assay description: Inhibition of human placental 17beta-HSD1 cytosolic fraction using [2, 4, 6, 7-3H]-estrone as substrate after 10 mins by HPLC analysis
In DepthDetails ArticlePubMed