BDBM50023366 CHEMBL3329813
SMILES CC(C(O)=O)c1ccc(CN2CCC(COC(=O)c3c4OCCCn4c4ccccc34)CC2)cc1
InChI Key InChIKey=RPITWOWTHILVSI-UHFFFAOYSA-N
Data  1 KI  1 IC50
  Tab Delimited (TSV)   2D SDfile   Computed 3D by Vconf -m prep SDfile
Find this compound or compounds like it in BindingDB:
Activity Spreadsheet -- Enzyme Inhibition Constant Data from BindingDB
Found 2 hits for monomerid = 50023366
Target5-hydroxytryptamine receptor 4(Homo sapiens (Human))
University Of Oslo
Curated by ChEMBL
LigandPNGBDBM50023366(CHEMBL3329813)
Affinity DataKi:  0.316nM. Assay description: Displacement of [3H]GR113808 from human 5HT4b receptor expressed in HEK293 cell membranes
In DepthDetails ArticlePubMed
TargetPotassium voltage-gated channel subfamily H member 2(Homo sapiens (Human))
University Of Oslo
Curated by ChEMBL
LigandPNGBDBM50023366(CHEMBL3329813)
Affinity DataIC50:  2.50E+4nM. Assay description: Inhibition of human ERG expressed in HEK293 cells assessed as reduction in channel tail current by patch clamp method
In DepthDetails ArticlePubMed