BDBM50023374 CHEMBL3329808
SMILES CCCCS(=O)(=O)Nc1ccc(CN2CCC(CNC(=O)c3cccc4OCCOc34)CC2)cc1
InChI Key InChIKey=UWMQCURVMGOBEO-UHFFFAOYSA-N
Data  1 KI
  Tab Delimited (TSV)   2D SDfile   Computed 3D by Vconf -m prep SDfile
Find this compound or compounds like it in BindingDB:
Activity Spreadsheet -- Enzyme Inhibition Constant Data from BindingDB
Found 1 hit for monomerid = 50023374
Target5-hydroxytryptamine receptor 4(Homo sapiens (Human))
University Of Oslo
Curated by ChEMBL
LigandPNGBDBM50023374(CHEMBL3329808)
Affinity DataKi:  0.251nM. Assay description: Displacement of [3H]GR113808 from human 5HT4b receptor expressed in HEK293 cell membranes
In DepthDetails ArticlePubMed