BDBM50023388 CHEMBL3325615
SMILES Fc1cccc(COC[C@@H]2C[C@H](CN2)Oc2cccc(NC(=N)c3cccs3)c2)c1
InChI Key InChIKey=POPRLCURNFTBSQ-PZJWPPBQSA-N
Data  3 KI
  Tab Delimited (TSV)   2D SDfile   Computed 3D by Vconf -m prep SDfile
Find this compound or compounds like it in BindingDB:
Activity Spreadsheet -- Enzyme Inhibition Constant Data from BindingDB
Found 3 hits for monomerid = 50023388
TargetNitric oxide synthase, brain(Rattus norvegicus (rat))
Northwestern University
Curated by ChEMBL
LigandPNGBDBM50023388(CHEMBL3325615)
Affinity DataKi:  68nM. Assay description: Inhibition of rat nNOS using L-arginine substrate
In DepthDetails ArticlePubMed
TargetNitric oxide synthase, endothelial(Bos taurus (bovine))
Northwestern University
Curated by ChEMBL
LigandPNGBDBM50023388(CHEMBL3325615)
Affinity DataKi:  5.89E+3nM. Assay description: Inhibition of bovine eNOS using L-arginine substrate
In DepthDetails ArticlePubMed
TargetNitric oxide synthase, inducible(Mus musculus (mouse))
Northwestern University
Curated by ChEMBL
LigandPNGBDBM50023388(CHEMBL3325615)
Affinity DataKi:  6.17E+3nM. Assay description: Inhibition of mouse macrophage iNOS using L-arginine substrate
In DepthDetails ArticlePubMed