BDBM50023415 CHEMBL3327324
SMILES OCCC(NCCCCOc1cc(ccc1OC(F)F)C(=O)Nc1c(Cl)cncc1Cl)C(O)=O
InChI Key InChIKey=MRLBVOBMAVAAQH-UHFFFAOYSA-N
Data  2 IC50
  Tab Delimited (TSV)   2D SDfile   Computed 3D by Vconf -m prep SDfile
Find this compound or compounds like it in BindingDB:
Activity Spreadsheet -- Enzyme Inhibition Constant Data from BindingDB
Found 2 hits for monomerid = 50023415
TargetcAMP-specific 3',5'-cyclic phosphodiesterase 4D(Homo sapiens (Human))
Amakem
Curated by ChEMBL
LigandPNGBDBM50023415(CHEMBL3327324)
Affinity DataIC50:  150nM. Assay description: Inhibition of human recombinant PDE4D2 activity assessed as residual cAMP concentration by HTRF assay
In DepthDetails ArticlePubMed
TargetcAMP-specific 3',5'-cyclic phosphodiesterase 4B(Homo sapiens (Human))
Amakem
Curated by ChEMBL
LigandPNGBDBM50023415(CHEMBL3327324)
Affinity DataIC50:  180nM. Assay description: Inhibition of human recombinant PDE4B1 activity assessed as residual cAMP concentration by HTRF assay
In DepthDetails ArticlePubMed