BDBM50023590 CHEMBL3355574
SMILES [H][C@@]1(CC[C@@H](CC1)NCc1ncc2OCC(=O)Nc2n1)[C@@H](N)Cn1c2cc(OC)c(F)cc2ncc1=O
InChI Key InChIKey=CFIGXKPRHYPCGF-DZKIICNBSA-N
Data  1 IC50
  Tab Delimited (TSV)   2D SDfile   Computed 3D by Vconf -m prep SDfile
Find this compound or compounds like it in BindingDB:
Activity Spreadsheet -- Enzyme Inhibition Constant Data from BindingDB
Found 1 hit for monomerid = 50023590
TargetPotassium voltage-gated channel subfamily H member 2(Homo sapiens (Human))
Astrazeneca
Curated by ChEMBL
LigandPNGBDBM50023590(CHEMBL3355574)
Affinity DataIC50: >3.33E+5nM. Assay description: Inhibition of human ERG by cell-based patch clamp method
In DepthDetails ArticlePubMed