BDBM50023712 5-Benzoylamino-2-{4-[(2,4-diamino-pteridin-6-ylmethyl)-formyl-amino]-benzoylamino}-pentanoic acid::CHEMBL27514
SMILES Nc1nc(N)c2nc(CN(C=O)c3ccc(cc3)C(=O)NC(CCCNC(=O)c3ccccc3)C(O)=O)cnc2n1
InChI Key InChIKey=NULPOTRBARNPPW-UHFFFAOYSA-N
Data  1 IC50
  Tab Delimited (TSV)   2D SDfile   Computed 3D by Vconf -m prep SDfile
Find this compound or compounds like it in BindingDB:
Activity Spreadsheet -- Enzyme Inhibition Constant Data from BindingDB
Found 1 hit for monomerid = 50023712
TargetDihydrofolate reductase(Mus musculus (Mouse))
Harvard Medical School
Curated by ChEMBL
LigandPNGBDBM50023712(5-Benzoylamino-2-{4-[(2,4-diamino-pteridin-6-ylmet...)
Affinity DataIC50:  34nM. Assay description: Inhibition of dihydrofolate reductase (DHFR) from murine leukemia cells
In DepthDetails ArticlePubMed