BDBM50023795 CHEMBL3330360
SMILES [H][C@@]12CC[C@]3(C)[C@]([H])(C(=O)C=C4[C@]5([H])[C@@H](C)[C@H](C)CC[C@]5(C)CC[C@@]34C)[C@@]1(C)CC[C@@H](O)[C@]2(C)NC(=O)CCCCCCC(=O)NO
InChI Key InChIKey=YBCYVWWAQQHZRT-PPZGYCOTSA-N
Data  1 IC50
  Tab Delimited (TSV)   2D SDfile   Computed 3D by Vconf -m prep SDfile
Find this compound or compounds like it in BindingDB:
Activity Spreadsheet -- Enzyme Inhibition Constant Data from BindingDB
Found 1 hit for monomerid = 50023795
TargetHistone deacetylase(Homo sapiens (Human))
Csir-Indian Institute Of Integrative Medicine
Curated by ChEMBL
LigandPNGBDBM50023795(CHEMBL3330360)
Affinity DataIC50: >5.00E+4nM. Assay description: Inhibition of HDAC (unknown origin)
In DepthDetails ArticlePubMed