BDBM50023813 4-Amino-5-chloro-N-(2-diethylamino-ethyl)-2-(2-hydroxy-propoxy)-benzamide::CHEMBL290069::R-4-Amino-5-chloro-N-(2-diethylamino-ethyl)-2-(2-hydroxy-propoxy)-benzamide::S-4-Amino-5-chloro-N-(2-diethylamino-ethyl)-2-(2-hydroxy-propoxy)-benzamide
SMILES CCN(CC)CCNC(=O)c1cc(Cl)c(N)cc1OCC(C)O
InChI Key InChIKey=GATCOSFCYSJURA-UHFFFAOYSA-N
Data  1 IC50
  Tab Delimited (TSV)   2D SDfile   Computed 3D by Vconf -m prep SDfile
Find this compound or compounds like it in BindingDB:
Activity Spreadsheet -- Enzyme Inhibition Constant Data from BindingDB
Found 1 hit for monomerid = 50023813
TargetD(2) dopamine receptor(Rattus norvegicus (rat))
Bristol-Myers
Curated by ChEMBL
LigandPNGBDBM50023813(4-Amino-5-chloro-N-(2-diethylamino-ethyl)-2-(2-hyd...)
Affinity DataIC50: >1.00E+3nM. Assay description: In vitro antagonistic activity against Dopamine receptor D2 was evaluated for the inhibition of [3H]spiperone binding
In DepthDetails ArticlePubMed