BDBM50023817 4-Amino-5-chloro-N-(2-diethylamino-ethyl)-2-(3-methyl-2-oxo-butoxy)-benzamide::CHEMBL39442
SMILES CCN(CC)CCNC(=O)c1cc(Cl)c(N)cc1OCC(=O)C(C)C
InChI Key InChIKey=MSCZCXPVLRFFCL-UHFFFAOYSA-N
Data  1 IC50
  Tab Delimited (TSV)   2D SDfile   Computed 3D by Vconf -m prep SDfile
Find this compound or compounds like it in BindingDB:
Activity Spreadsheet -- Enzyme Inhibition Constant Data from BindingDB
Found 1 hit for monomerid = 50023817
TargetD(2) dopamine receptor(Rattus norvegicus (rat))
Bristol-Myers
Curated by ChEMBL
LigandPNGBDBM50023817(4-Amino-5-chloro-N-(2-diethylamino-ethyl)-2-(3-met...)
Affinity DataIC50: >1.00E+3nM. Assay description: In vitro antagonistic activity against Dopamine receptor D2 was evaluated for the inhibition of [3H]spiperone binding
In DepthDetails ArticlePubMed