BDBM50023829 4-Amino-5-chloro-N-(2-diethylamino-ethyl)-2-propoxy-benzamide::CHEMBL40672
SMILES CCCOc1cc(N)c(Cl)cc1C(=O)NCCN(CC)CC
InChI Key InChIKey=CSJPRGDPEWTNSB-UHFFFAOYSA-N
Data  1 IC50
  Tab Delimited (TSV)   2D SDfile   Computed 3D by Vconf -m prep SDfile
Find this compound or compounds like it in BindingDB:
Activity Spreadsheet -- Enzyme Inhibition Constant Data from BindingDB
Found 1 hit for monomerid = 50023829
TargetD(2) dopamine receptor(Rattus norvegicus (rat))
Bristol-Myers
Curated by ChEMBL
LigandPNGBDBM50023829(4-Amino-5-chloro-N-(2-diethylamino-ethyl)-2-propox...)
Affinity DataIC50: >1.00E+3nM. Assay description: In vitro antagonistic activity against Dopamine receptor D2 was evaluated for the inhibition of [3H]spiperone binding
In DepthDetails ArticlePubMed