BDBM50023872 CHEMBL287749::Dimethyl-penta-2,3-dienyl-amine;oxalic acid
SMILES CC=C=CCN(C)C
InChI Key InChIKey=IUZPNQIHEXSIHB-YFKPBYRVSA-N
Data  2 KI
  Tab Delimited (TSV)   2D SDfile   Computed 3D by Vconf -m prep SDfile
Find this compound or compounds like it in BindingDB:
Activity Spreadsheet -- Enzyme Inhibition Constant Data from BindingDB
Found 2 hits for monomerid = 50023872
TargetAmine oxidase [flavin-containing] B(Bos taurus)
Syntex Research
Curated by ChEMBL
LigandPNGBDBM50023872(CHEMBL287749 | Dimethyl-penta-2,3-dienyl-amine;oxa...)
Affinity DataKi:  5.90E+4nM. Assay description: In vitro inhibition of bovine monoamine oxidase B.
In DepthDetails ArticlePubMed
TargetAmine oxidase [flavin-containing] B(Bos taurus)
Syntex Research
Curated by ChEMBL
LigandPNGBDBM50023872(CHEMBL287749 | Dimethyl-penta-2,3-dienyl-amine;oxa...)
Affinity DataKi:  1.00E+5nM. Assay description: In vitro inhibition of bovine monoamine oxidase B.
In DepthDetails ArticlePubMed