BDBM50023892 2-{4-[(2,4-Diamino-pteridin-6-ylmethyl)-amino]-benzoylamino}-4-(3,4-dichloro-benzylcarbamoyl)-butyric acid::CHEMBL416261
SMILES Nc1nc(N)c2nc(CNc3ccc(cc3)C(=O)NC(CCC(=O)NCc3ccc(Cl)c(Cl)c3)C(O)=O)cnc2n1
InChI Key InChIKey=NWENTCSFEAOENB-UHFFFAOYSA-N
Data  1 IC50
  Tab Delimited (TSV)   2D SDfile   Computed 3D by Vconf -m prep SDfile
Find this compound or compounds like it in BindingDB:
Activity Spreadsheet -- Enzyme Inhibition Constant Data from BindingDB
Found 1 hit for monomerid = 50023892
TargetDihydrofolate reductase(Mus musculus (Mouse))
TBA
Curated by ChEMBL
LigandPNGBDBM50023892(2-{4-[(2,4-Diamino-pteridin-6-ylmethyl)-amino]-ben...)
Affinity DataIC50:  130nM. Assay description: Compound was tested for its inhibitory concentration to inhibit the enzyme Dihydro Folate Reductase (DHFR) from murine L1210 leukemia cells.
In DepthDetails ArticlePubMed