BDBM50024118 5-(3,7-Dimethyl-octa-2,6-dienylamino)-1-hydroxymethyl-cyclohexane-1,2,3,4-tetraol::CHEMBL3349438
SMILES [#6]\[#6](-[#6])=[#6]/[#6]-[#6]\[#6](-[#6])=[#6]\[#6]-[#7]-[#6@H]-1-[#6][C@]([#8])([#6]-[#8])[#6@@H](-[#8])-[#6@H](-[#8])-[#6@H]-1-[#8]
InChI Key InChIKey=GJCPDBXQCCIZHF-JDHOBIMTSA-N
Data  2 IC50
  Tab Delimited (TSV)   2D SDfile   Computed 3D by Vconf -m prep SDfile
Find this compound or compounds like it in BindingDB:
Activity Spreadsheet -- Enzyme Inhibition Constant Data from BindingDB
Found 2 hits for monomerid = 50024118
TargetMaltase-glucoamylase(Homo sapiens (Human))
TBA
Curated by ChEMBL
LigandPNGBDBM50024118(5-(3,7-Dimethyl-octa-2,6-dienylamino)-1-hydroxymet...)
Affinity DataIC50:  520nM. Assay description: Inhibitory activity against porcine maltase
In DepthDetails ArticlePubMed
TargetSucrase-isomaltase, intestinal(Homo sapiens (Human))
TBA
Curated by ChEMBL
LigandPNGBDBM50024118(5-(3,7-Dimethyl-octa-2,6-dienylamino)-1-hydroxymet...)
Affinity DataIC50:  11nM. Assay description: Alpha-D-glucosidase inhibitory activity and enzyme inhibition in vitro against porcine sucrase
In DepthDetails ArticlePubMed