BDBM50024371 CHEMBL3330475
SMILES [H][C@@]12COc3cc(ccc3N1C(=O)O[C@H]2CNC(=O)Nc1ccc(Cl)s1)N1CCOCC1=O
InChI Key InChIKey=PZEHGCYSEIYNMX-ZFWWWQNUSA-N
Data  1 IC50
  Tab Delimited (TSV)   2D SDfile   Computed 3D by Vconf -m prep SDfile
Find this compound or compounds like it in BindingDB:
Activity Spreadsheet -- Enzyme Inhibition Constant Data from BindingDB
Found 1 hit for monomerid = 50024371
TargetCoagulation factor X(Homo sapiens (Human))
Chinese Academy Of Sciences
Curated by ChEMBL
LigandPNGBDBM50024371(CHEMBL3330475)
Affinity DataIC50:  89nM. Assay description: Inhibition of human factor 10a using N-Z-D-Arg-Gly-Arg-pNA, S-2765 chromogenic substrate
In DepthDetails ArticlePubMed