BDBM50024467 2-{4-[(2-Amino-4-oxo-3,4-dihydro-quinazolin-6-ylmethyl)-cyclopropylmethyl-amino]-benzoylamino}-pentanedioic acid::CHEMBL25108
SMILES Nc1nc2ccc(CN(CC3CC3)c3ccc(cc3)C(=O)NC(CCC(O)=O)C(O)=O)cc2c(=O)[nH]1
InChI Key InChIKey=LDCZYGRQUFFFHE-UHFFFAOYSA-N
Data  1 KI
  Tab Delimited (TSV)   2D SDfile   Computed 3D by Vconf -m prep SDfile
Find this compound or compounds like it in BindingDB:
Activity Spreadsheet -- Enzyme Inhibition Constant Data from BindingDB
Found 1 hit for monomerid = 50024467
LigandPNGBDBM50024467(2-{4-[(2-Amino-4-oxo-3,4-dihydro-quinazolin-6-ylme...)
Affinity DataKi:  8.00E+3nM. Assay description: Inhibition of GAR transformylase isolated from murine lymphoma cell line L5178Y
In DepthDetails ArticlePubMed