BDBM50024648 CHEMBL3330598
SMILES COc1ccc(N2CCN(CCCCn3ncc(=O)n(C)c3=O)CC2)c(OC)c1
InChI Key InChIKey=MZRJFLMQUPZISJ-UHFFFAOYSA-N
Data  1 KI
  Tab Delimited (TSV)   2D SDfile   Computed 3D by Vconf -m prep SDfile
Find this compound or compounds like it in BindingDB:
Activity Spreadsheet -- Enzyme Inhibition Constant Data from BindingDB
Found 1 hit for monomerid = 50024648
Target5-hydroxytryptamine receptor 1A(Homo sapiens (Human))
Stony Brook University
Curated by ChEMBL
LigandPNGBDBM50024648(CHEMBL3330598)
Affinity DataKi:  190nM. Assay description: Displacement of [3H]8-OH-DPAT from 5HT1AR (unknown origin) by competition binding assay
In DepthDetails ArticlePubMed