BDBM50024650 CHEMBL3330597
SMILES COc1ccc(cc1)N1CCN(CCCCn2ncc(=O)n(C)c2=O)CC1
InChI Key InChIKey=JUMNVQSOWQLVGD-UHFFFAOYSA-N
Data  1 KI
  Tab Delimited (TSV)   2D SDfile   Computed 3D by Vconf -m prep SDfile
Find this compound or compounds like it in BindingDB:
Activity Spreadsheet -- Enzyme Inhibition Constant Data from BindingDB
Found 1 hit for monomerid = 50024650
Target5-hydroxytryptamine receptor 1A(Homo sapiens (Human))
Stony Brook University
Curated by ChEMBL
LigandPNGBDBM50024650(CHEMBL3330597)
Affinity DataKi:  414nM. Assay description: Displacement of [3H]8-OH-DPAT from 5HT1AR (unknown origin) by competition binding assay
In DepthDetails ArticlePubMed