BDBM50024732 CHEMBL3342427
SMILES Cc1nn(C)c(O)c1C(=O)c1ccc2nc(C)n(-c3ccc(F)cc3C)c(=O)c2c1
InChI Key InChIKey=OJLKCGKZIRIPPR-UHFFFAOYSA-N
Data  1 KI
  Tab Delimited (TSV)   2D SDfile   Computed 3D by Vconf -m prep SDfile
Find this compound or compounds like it in BindingDB:
Activity Spreadsheet -- Enzyme Inhibition Constant Data from BindingDB
Found 1 hit for monomerid = 50024732
Target4-hydroxyphenylpyruvate dioxygenase(Homo sapiens (Human))
Central China Normal University
Curated by ChEMBL
LigandPNGBDBM50024732(CHEMBL3342427)
Affinity DataKi:  219nM. Assay description: Inhibition of purified His6-tagged recombinant human HPPD assessed as inhibition of maleylacetoacetate formation after 30 mins by UV/visible spectrop...
In DepthDetails ArticlePubMed