BDBM50024870 CHEMBL3334506
SMILES O=c1oc2cc(OCCCCN3CCC(Cc4ccccc4)CC3)ccc2c2ccccc12
InChI Key InChIKey=KNRZCCYRCNQTBX-UHFFFAOYSA-N
Data  2 IC50
  Tab Delimited (TSV)   2D SDfile   Computed 3D by Vconf -m prep SDfile
Find this compound or compounds like it in BindingDB:
Activity Spreadsheet -- Enzyme Inhibition Constant Data from BindingDB
Found 2 hits for monomerid = 50024870
TargetAcetylcholinesterase(Homo sapiens (Human))
Eastern Mediterranean University
Curated by ChEMBL
LigandPNGBDBM50024870(CHEMBL3334506)
Affinity DataIC50:  1.42E+4nM. Assay description: Inhibition of human recombinant AChE using acetylthiocholine iodide substrate incubated for 15 mins by spectrophotometry based Ellman's method
In DepthDetails ArticlePubMed
TargetCholinesterase(Homo sapiens (Human))
Eastern Mediterranean University
Curated by ChEMBL
LigandPNGBDBM50024870(CHEMBL3334506)
Affinity DataIC50: >4.00E+4nM. Assay description: Inhibition of human recombinant BuChE using butyrylthiocholine iodide substrate incubated for 15 mins by spectrophotometry based Ellman's method
In DepthDetails ArticlePubMed