BDBM50024950 3-(5-Imidazol-1-yl-pentyl)-8-trifluoromethyl-1H-quinazoline-2,4-dione::CHEMBL307631
SMILES FC(F)(F)c1cccc2c1[nH]c(=O)n(CCCCCn1ccnc1)c2=O
InChI Key InChIKey=VPSPPYOHUVONNE-UHFFFAOYSA-N
Data  1 IC50
  Tab Delimited (TSV)   2D SDfile   Computed 3D by Vconf -m prep SDfile
Find this compound or compounds like it in BindingDB:
Activity Spreadsheet -- Enzyme Inhibition Constant Data from BindingDB
Found 1 hit for monomerid = 50024950
TargetThromboxane-A synthase(Rattus norvegicus)
Medical Research Division Of American Cyanamid
Curated by ChEMBL
LigandPNGBDBM50024950(3-(5-Imidazol-1-yl-pentyl)-8-trifluoromethyl-1H-qu...)
Affinity DataIC50:  10nM. Assay description: Tested for inhibition of thromboxane synthetase from spontaneously hypertensive rats
In DepthDetails ArticlePubMed