BDBM50024959 2,3-Butanedione Monoxime::CHEBI:4480::CHEMBL1255578
SMILES CC(=O)C(\C)=N\O
InChI Key InChIKey=FSEUPUDHEBLWJY-HWKANZROSA-N
Data  1 Kd
  Tab Delimited (TSV)   2D SDfile   Computed 3D by Vconf -m prep SDfile
Find this compound or compounds like it in BindingDB:
Activity Spreadsheet -- Enzyme Inhibition Constant Data from BindingDB
Found 1 hit for monomerid = 50024959
TargetAcetylcholinesterase(Homo sapiens (Human))
Pt. Ravishankar Shukla University
Curated by ChEMBL
LigandPNGBDBM50024959(2,3-Butanedione Monoxime | CHEBI:4480 | CHEMBL1255...)
Affinity DataKd:  3.93E+5nM. Assay description: Binding affinity to paraoxon-inhibited AChE (unknown origin)
In DepthDetails ArticlePubMed