BDBM50024961 CHEMBL3335074
SMILES [Br-].C[n+]1cccc(\C=N\O)c1
InChI Key InChIKey=IAEUGXIBQZYHBN-HAAWTFQLSA-N
Data  1 Kd
  Tab Delimited (TSV)   2D SDfile   Computed 3D by Vconf -m prep SDfile
Find this compound or compounds like it in BindingDB:
Activity Spreadsheet -- Enzyme Inhibition Constant Data from BindingDB
Found 1 hit for monomerid = 50024961
TargetAcetylcholinesterase(Homo sapiens (Human))
Pt. Ravishankar Shukla University
Curated by ChEMBL
LigandPNGBDBM50024961(CHEMBL3335074)
Affinity DataKd:  1.75E+5nM. Assay description: Binding affinity to paraoxon-inhibited AChE (unknown origin)
In DepthDetails ArticlePubMed