BDBM50024964 CHEMBL491725
SMILES [Br-].[Br-].O\N=C/c1cc[n+](Cc2ccccc2C[n+]2ccc(\C=N/O)cc2)cc1
InChI Key InChIKey=ADMGREGKZSCMBN-UHFFFAOYSA-N
Data  1 Kd
  Tab Delimited (TSV)   2D SDfile   Computed 3D by Vconf -m prep SDfile
Find this compound or compounds like it in BindingDB:
Activity Spreadsheet -- Enzyme Inhibition Constant Data from BindingDB
Found 1 hit for monomerid = 50024964
TargetAcetylcholinesterase(Homo sapiens (Human))
Pt. Ravishankar Shukla University
Curated by ChEMBL
LigandPNGBDBM50024964(CHEMBL491725)
Affinity DataKd:  1.12E+5nM. Assay description: Binding affinity to paraoxon-inhibited AChE (unknown origin)
In DepthDetails ArticlePubMed