BDBM50025004 CHEMBL3143467::p5'(br8A)2'p5'(br8A)2'p5'(br8A)2'p5'(br8A)2'p5'(br8A)
SMILES Nc1ncnc2n([C@@H]3O[C@H](COP(O)(=O)O[C@@H]4[C@H](O)[C@@H](COP(O)(=O)O[C@@H]5[C@H](O)[C@@H](CO)O[C@H]5n5c(Br)nc6c(N)ncnc56)O[C@H]4n4c(Br)nc5c(N)ncnc45)[C@@H](O)[C@H]3O)c(Br)nc12
InChI Key InChIKey=ZONIXOUJZOBPJG-UHFFFAOYSA-N
Data  1 IC50
  Tab Delimited (TSV)   2D SDfile   Computed 3D by Vconf -m prep SDfile
Find this compound or compounds like it in BindingDB:
Activity Spreadsheet -- Enzyme Inhibition Constant Data from BindingDB
Found 1 hit for monomerid = 50025004
Target2-5A-dependent ribonuclease(Mus musculus)
TBA
Curated by ChEMBL
LigandPNGBDBM50025004(CHEMBL3143467 | p5'(br8A)2'p5'(br8A)2'p5'(br8A)2'p...)
Affinity DataIC50: >5.00E+4nM. Assay description: compound was tested for activation of RNase L by measuring concentration required for 50% inhibition of protein synthesis in mouse L cell extracts
In DepthDetails ArticlePubMed