BDBM50025096 CHEMBL2372191
SMILES CC(C)C[C@H](NC(=O)CNC(=O)[C@H](C)NC(=O)[C@H](CC(C)C)NC(=O)[C@H](CCCNC(N)=O)NC(=O)[C@H](Cc1cnc[nH]1)NC(=O)[C@@H](NC(=O)[C@@H](NC(=O)[C@H](Cc1c[nH]c2ccccc12)NC(C)=O)C(C)C)[C@@H](C)O)C(=O)N[C@@H](CC(C)C)C(=O)N[C@@H](CO)C(=O)N[C@@H](CCCNC(N)=O)C(=O)N[C@@H](CO)C(=O)NCC(=O)NCC(=O)N[C@@H](C(C)C)C(=O)N[C@@H](C(C)C)C(=O)N[C@@H](CCCCNC(N)=N)C(=O)N[C@@H](CCCCN)C(=O)N[C@@H](CC(N)=O)C(=O)N[C@@H](Cc1ccccc1)C(=O)N[C@@H](C(C)C)C(=O)N1CCC[C@H]1C(=O)N[C@@H]([C@@H](C)O)C(=O)N[C@@H](CC(O)=O)C(=O)N[C@@H](C(C)C)C(=O)NCC(=O)N1CCC[C@H]1C(=O)N1Cc2[nH]c3ccccc3c2C[C@H]1C(=O)N[C@@H](C)C(=O)N[C@@H](Cc1ccccc1)C(N)=O
InChI Key InChIKey=MJBJJQRZFRTMTL-ZWKABGBXSA-N
Data  1 IC50
  Tab Delimited (TSV)   2D SDfile   Computed 3D by Vconf -m prep SDfile
Find this compound or compounds like it in BindingDB:
Activity Spreadsheet -- Enzyme Inhibition Constant Data from BindingDB
Found 1 hit for monomerid = 50025096
TargetCalcitonin gene-related peptide 1(Homo sapiens (Human))
Amgen
Curated by ChEMBL
LigandPNGBDBM50025096(CHEMBL2372191)
Affinity DataIC50:  79nM. Assay description: Antagonist activity at human CGRP1 receptor in human SK-N-MC cells assessed as effect on human alpha-CGRP-induced cAMP accumulation
In DepthDetails ArticlePubMed