BDBM50025138 CHEMBL296277::{2-[2-(4-Cyano-phenyl)-N-hydroxy-2-oxo-acetimidoylsulfanyl]-ethyl}-diethyl-methyl-ammonium; chloride
SMILES CC[N+](C)(CC)CCSC(N=O)C(=O)c1ccc(cc1)C#N
InChI Key InChIKey=PQQALLYPIYWBSC-UHFFFAOYSA-N
Data  1 IC50
  Tab Delimited (TSV)   2D SDfile   Computed 3D by Vconf -m prep SDfile
Find this compound or compounds like it in BindingDB:
Activity Spreadsheet -- Enzyme Inhibition Constant Data from BindingDB
Found 1 hit for monomerid = 50025138
TargetAcetylcholinesterase(Homo sapiens (Human))
TBA
Curated by ChEMBL
LigandPNGBDBM50025138(CHEMBL296277 | {2-[2-(4-Cyano-phenyl)-N-hydroxy-2-...)
Affinity DataIC50: >1.00E+6nM. Assay description: Reversible inhibition of Human AchE
In DepthDetails ArticlePubMed