BDBM50025401 CHEMBL3085568::Sodium; 2-(1,4a,6a-trimethyl-2-oxo-hexadecahydro-indeno[5,4-f]quinolin-7-yl)-propionate
SMILES [Na+].[H][C@@]12CC[C@H](C([O-])=O)[C@@]1(C)CC[C@@]1([H])[C@@]2([H])CCC2N(C)C(=O)CC[C@]12C
InChI Key InChIKey=YUWHODIVIHOSHO-ULLJXSFRSA-M
Data  2 IC50
  Tab Delimited (TSV)   2D SDfile   Computed 3D by Vconf -m prep SDfile
Find this compound or compounds like it in BindingDB:
Activity Spreadsheet -- Enzyme Inhibition Constant Data from BindingDB
Found 2 hits for monomerid = 50025401
TargetAndrogen receptor(Rattus norvegicus (Rat))
TBA
Curated by ChEMBL
LigandPNGBDBM50025401(CHEMBL3085568 | Sodium; 2-(1,4a,6a-trimethyl-2-oxo...)
Affinity DataIC50:  9.10E+3nM. Assay description: In vitro antagonist activity against rat prostatic androgen receptor (AR)
In DepthDetails ArticlePubMed
Target3-oxo-5-alpha-steroid 4-dehydrogenase 1/2(Rattus norvegicus)
TBA
Curated by ChEMBL
LigandPNGBDBM50025401(CHEMBL3085568 | Sodium; 2-(1,4a,6a-trimethyl-2-oxo...)
Affinity DataIC50:  37nM. Assay description: In vitro inhibitory activity against rat prostatic steroid 5-alpha-reductase
In DepthDetails ArticlePubMed