BDBM50025434 1,4a,6a-Trimethyl-2-oxo-octadecahydro-1-aza-chrysene-7-carboxylic acid diethylamide::CHEMBL3349106
SMILES [H][C@@]12CC[C@@]3([H])[C@]4([H])CCC[C@H](C(=O)N(CC)CC)[C@@]4(C)CC[C@]3([H])[C@@]1(C)CCC(=O)N2C
InChI Key InChIKey=GZGRNURZGJTHEM-IPYMPHHTSA-N
Data  1 IC50
  Tab Delimited (TSV)   2D SDfile   Computed 3D by Vconf -m prep SDfile
Find this compound or compounds like it in BindingDB:
Activity Spreadsheet -- Enzyme Inhibition Constant Data from BindingDB
Found 1 hit for monomerid = 50025434
TargetAndrogen receptor(Rattus norvegicus (Rat))
TBA
Curated by ChEMBL
LigandPNGBDBM50025434(1,4a,6a-Trimethyl-2-oxo-octadecahydro-1-aza-chryse...)
Affinity DataIC50:  7.10E+3nM. Assay description: In vitro antagonist activity against rat prostatic androgen receptor (AR)
In DepthDetails ArticlePubMed