BDBM50025460 1-(3,4,5-Trihydroxy-tetrahydro-pyran-2-yl)-[1,3]diazepan-2-one; compound with 1-(3,4-dihydroxy-5-hydroxymethyl-tetrahydro-furan-2-yl)-[1,3]diazepan-2-one::CHEMBL77547
SMILES O[C@@H]1CO[C@H]([C@H](O)[C@@H]1O)N1CCCCNC1=O
InChI Key InChIKey=BXJPUKLMZPKXMB-FNCVBFRFSA-N
Data  1 KI
  Tab Delimited (TSV)   2D SDfile   Computed 3D by Vconf -m prep SDfile
Find this compound or compounds like it in BindingDB:
Activity Spreadsheet -- Enzyme Inhibition Constant Data from BindingDB
Found 1 hit for monomerid = 50025460
TargetCytidine deaminase(Mus musculus)
TBA
Curated by ChEMBL
LigandPNGBDBM50025460(1-(3,4,5-Trihydroxy-tetrahydro-pyran-2-yl)-[1,3]di...)
Affinity DataKi:  6.60E+3nM. Assay description: Compound was tested in vivo for its ability to inhibit mouse kidney cytidine deaminase (CDA)
In DepthDetails ArticlePubMed