BDBM50025624 CHEMBL17329::Methyl 2,5-Dihydroxycinnamate::Methyl 3-(2,5-Dihydroxyphenyl)Acrylate
SMILES COC(=O)\C=C\c1cc(O)ccc1O
InChI Key InChIKey=BQCNSTFWSKOWMA-GORDUTHDSA-N
Data  1 IC50
  Tab Delimited (TSV)   2D SDfile   Computed 3D by Vconf -m prep SDfile
Find this compound or compounds like it in BindingDB:
Activity Spreadsheet -- Enzyme Inhibition Constant Data from BindingDB
Found 1 hit for monomerid = 50025624
TargetEpidermal growth factor receptor(Homo sapiens (Human))
TBA
Curated by ChEMBL
LigandPNGBDBM50025624(CHEMBL17329 | Methyl 2,5-Dihydroxycinnamate | Meth...)
Affinity DataIC50:  1.02E+5nM. Assay description: Inhibition of EGFR
In DepthDetails ArticlePubMed