BDBM50025631 CHEMBL3335119
SMILES CO[C@H]1CC[C@@H](CC1)NC(=O)c1n[nH]cc1NC(=O)C1CCC(F)(F)CC1
InChI Key
Data  1 IC50
  Tab Delimited (TSV)   2D SDfile   Computed 3D by Vconf -m prep SDfile
Find this compound or compounds like it in BindingDB:
Activity Spreadsheet -- Enzyme Inhibition Constant Data from BindingDB
Found 1 hit for monomerid = 50025631
TargetGlycogen synthase kinase-3(Homo sapiens (Human))
University Of Dundee
Curated by ChEMBL
LigandPNGBDBM50025631(CHEMBL3335119)
Affinity DataIC50:  8nM. Assay description: Inhibition of human GSK3 using biotinylated GSP2 substrate by flashplate assay
In DepthDetails ArticlePubMed