BDBM50025639 CHEMBL3335140
SMILES CO[C@H]1CC[C@@H](CC1)NC(=O)c1n[nH]cc1NC(=O)c1ccccc1Nc1cccc(C)c1C
InChI Key
Data  1 IC50
  Tab Delimited (TSV)   2D SDfile   Computed 3D by Vconf -m prep SDfile
Find this compound or compounds like it in BindingDB:
Activity Spreadsheet -- Enzyme Inhibition Constant Data from BindingDB
Found 1 hit for monomerid = 50025639
TargetGlycogen synthase kinase-3(Homo sapiens (Human))
University Of Dundee
Curated by ChEMBL
LigandPNGBDBM50025639(CHEMBL3335140)
Affinity DataIC50:  30nM. Assay description: Inhibition of human GSK3 using biotinylated GSP2 substrate by flashplate assay
In DepthDetails ArticlePubMed