BDBM50025665 CHEMBL3335168
SMILES COc1cccc(OC)c1C(=O)Nc1c[nH]nc1C(=O)N[C@H]1CC[C@H](O)CC1
InChI Key
Data  1 IC50
  Tab Delimited (TSV)   2D SDfile   Computed 3D by Vconf -m prep SDfile
Find this compound or compounds like it in BindingDB:
Activity Spreadsheet -- Enzyme Inhibition Constant Data from BindingDB
Found 1 hit for monomerid = 50025665
TargetGlycogen synthase kinase-3(Homo sapiens (Human))
University Of Dundee
Curated by ChEMBL
LigandPNGBDBM50025665(CHEMBL3335168)
Affinity DataIC50:  70nM. Assay description: Inhibition of human GSK3 using biotinylated GSP2 substrate by flashplate assay
In DepthDetails ArticlePubMed