BDBM50025693 CHEMBL3330875
SMILES CC(C)S(=O)(=O)c1ccccc1Nc1nc(Nc2nc(cs2)C(=O)N2CC3(C2)CCNCC3)ncc1Cl
InChI Key InChIKey=DEVJFUWRKXOKKP-UHFFFAOYSA-N
Data  1 IC50
  Tab Delimited (TSV)   2D SDfile   Computed 3D by Vconf -m prep SDfile
Find this compound or compounds like it in BindingDB:
Activity Spreadsheet -- Enzyme Inhibition Constant Data from BindingDB
Found 1 hit for monomerid = 50025693
TargetALK tyrosine kinase receptor(Homo sapiens (Human))
Shanghai Institute Of Materia Medica (Simm)
Curated by ChEMBL
LigandPNGBDBM50025693(CHEMBL3330875)
Affinity DataIC50: >1.00E+3nM. Assay description: Inhibition of purified ALK (unknown origin) after 60 mins by ELISA kinase assay
In DepthDetails ArticlePubMed