BDBM50025809 1-(3-Methoxy-benzyl)-1,3-dihydro-imidazole-2-thione::CHEMBL68008
SMILES COc1cccc(Cn2cc[nH]c2=S)c1
InChI Key InChIKey=BFWOZEYCOGTXIN-UHFFFAOYSA-N
Data  4 IC50
  Tab Delimited (TSV)   2D SDfile   Computed 3D by Vconf -m prep SDfile
Find this compound or compounds like it in BindingDB:
Activity Spreadsheet -- Enzyme Inhibition Constant Data from BindingDB
Found 4 hits for monomerid = 50025809
TargetDopamine beta-hydroxylase(Bos taurus)
TBA
Curated by ChEMBL
LigandPNGBDBM50025809(1-(3-Methoxy-benzyl)-1,3-dihydro-imidazole-2-thion...)
Affinity DataIC50:  1.57E+5nM. Assay description: Inhibitory Concentration against bovine Dopamine beta hydroxylase (DBH); Range is between (118-215).
In DepthDetails ArticlePubMed
TargetDopamine beta-hydroxylase(Homo sapiens (Human))
Molecular Simulations
Curated by ChEMBL
LigandPNGBDBM50025809(1-(3-Methoxy-benzyl)-1,3-dihydro-imidazole-2-thion...)
Affinity DataIC50:  1.58E+5nM. Assay description: Inhibition of dopamine beta hydroxylase
In DepthDetails ArticlePubMed
TargetDopamine beta-hydroxylase(Homo sapiens (Human))
Molecular Simulations
Curated by ChEMBL
LigandPNGBDBM50025809(1-(3-Methoxy-benzyl)-1,3-dihydro-imidazole-2-thion...)
Affinity DataIC50:  1.58E+5nM. Assay description: Inhibition of dopamine beta-hydroxylase (DbetaH) enzyme
In DepthDetails ArticlePubMed
TargetDopamine beta-hydroxylase(Rattus norvegicus)
University Of Illinois
Curated by ChEMBL
LigandPNGBDBM50025809(1-(3-Methoxy-benzyl)-1,3-dihydro-imidazole-2-thion...)
Affinity DataIC50:  1.58E+5nM. Assay description: Inhibition of dopamine beta-hydroxylase (DbetaH) in hypertensive rats when administered orally (or) intraperitoneally
In DepthDetails ArticlePubMed